{"text_format":"3","workbook":"xlsx","n_sheets":4,"sheets":["Tabelle1","§ 13 RVG","§ 49 RVG","Tabelle2"],"not_rendered":{"defined_names":3,"comments":1},"read":"whole","date_system":"1900"}

{"sheet":"Tabelle1","index":0,"n_rows":25,"n_cols":10,"rows_kept":25,"merged":[[15,1,15,2],[21,0,22,0]]}
["Rechtsanwaltsvergütung nach dem RVG (Stand 01.01.2021)",{"$nulls":5},{"$f":"(C4+C5)*VLOOKUP(B4,'§ 13 RVG'!A1:B250,2)","v":{"v":434.2,"d":"434.20 €"}},{"$f":"(C4+C5)*VLOOKUP(B4,'§ 49 RVG'!A1:B24,2)","v":{"v":369.2,"d":"369.20 €"}},{"$f":"C8*VLOOKUP(B8,'§ 13 RVG'!A1:B250,2)","v":{"v":49,"d":"49.00 €"}},{"$f":"C8*VLOOKUP(B8,'§ 49 RVG'!A1:B24,2)","v":{"v":49,"d":"49.00 €"}}]
[{"$nulls":6},{"$f":"IF(B6=0,0,C6*VLOOKUP(B6,'§ 13 RVG'!$A$1:$B$250,2))","v":0},{"$f":"IF(B6=0,0,C6*VLOOKUP(B6,'§ 49 RVG'!$A$1:$B$24,2))","v":0},{"$f":"IF(B9=0,0,C9*VLOOKUP(B9,'§ 13 RVG'!$A$1:$B$250,2))","v":0},{"$f":"IF(B9=0,0,C9*VLOOKUP(B9,'§ 49 RVG'!$A$1:$B$24,2))","v":0}]
[null,"Streitwert","Gebührensatz","Wahlanwalt § 13 RVG","PKH § 49 RVG",null,{"$f":"SUM(G1:G2)","v":{"v":434.2,"d":"434.20 €"}},{"$f":"SUM(H1:H2)","v":{"v":369.2,"d":"369.20 €"}},{"$f":"SUM(I1:I2)","v":{"v":49,"d":"49.00 €"}},{"$f":"SUM(J1:J2)","v":{"v":49,"d":"49.00 €"}}]
["Verfahrensgebühr",{"v":5000,"d":"5,000.00 €"},1.3,{"$f":"IF(C4*VLOOKUP(B4,'§ 13 RVG'!$A$1:$B$250,2)<=15,15,C4*VLOOKUP(B4,'§ 13 RVG'!$A$1:$B$250,2))","v":{"v":434.2,"d":"434.20 €"}},{"$f":"IF(C4*VLOOKUP(B4,'§ 49 RVG'!A1:B23,2)<=15,15,C4*VLOOKUP(B4,'§ 49 RVG'!A1:B23,2))","v":{"v":369.2,"d":"369.20 €"}},null,{"$f":"(C4+C5)*VLOOKUP((B4+B6),'§ 13 RVG'!$A$1:$B$250,2)","v":{"v":434.2,"d":"434.20 €"}},{"$f":"(C4+C5)*VLOOKUP((B4+B6),'§ 49 RVG'!$A$1:$B$250,2)","v":{"v":369.2,"d":"369.20 €"}},{"$f":"C9*VLOOKUP((B8+B9),'§ 13 RVG'!$A$1:$B$250,2)","v":{"v":73.5,"d":"73.50 €"}},{"$f":"C9*VLOOKUP((B8+B9),'§ 49 RVG'!$A$1:$B$24,2)","v":{"v":73.5,"d":"73.50 €"}}]
["mehrere Auftraggeber",0,{"$f":"IF(B5*0.3<=2,B5*0.3,2)","v":0},{"$f":"IF(B5=0,0,C5*VLOOKUP(B4,'§ 13 RVG'!A1:B250,2))","v":0},{"$f":"IF(B5=0,0,C5*VLOOKUP(B4,'§ 49 RVG'!A1:B23,2))","v":0},null,{"$f":"G4-G1","v":0},{"$f":"H4-H1","v":0},{"$f":"I4-I1","v":{"v":24.5,"d":"24.50 €"}},{"$f":"J4-J1","v":{"v":24.5,"d":"24.50 €"}}]
["Verfahrensgeb. bei Mehrvergl.",0,{"$f":"0.8+C5","v":0.8},{"$f":"IF(B6=0,0,IF(G4<G3,G5,G2))","v":0},{"$f":"IF(B6=0,0,IF(H4<H3,H5,H2))","v":0}]
["Terminsgebühr",{"$f":"B4","v":{"v":5000,"d":"5,000.00 €"}},1.2,{"$f":"IF(B7=0,0,C7*VLOOKUP(B7,'§ 13 RVG'!$A$1:$B$250,2))","v":{"v":400.8,"d":"400.80 €"}},{"$f":"IF(B7=0,0,C7*VLOOKUP(B7,'§ 49 RVG'!$A$1:$B$23,2))","v":{"v":340.8,"d":"340.80 €"}}]
["Einigungsgebühr",0,1,{"$f":"IF(B8=0,0,C8*VLOOKUP(B8,'§ 13 RVG'!$A$1:$B$250,2))","v":0},{"$f":"IF(B8=0,0,C8*VLOOKUP(B8,'§ 49 RVG'!$A$1:$B$23,2))","v":0},null,null,0,30]
["Einigungsgeb. bei Mehrvergl.",{"$f":"B6","v":0},1.5,{"$f":"IF(I4<I3,I5,I2)","v":0},{"$f":"IF(J4<J3,J5,J2)","v":0}]
["Anrechnung Geschäftsgebühr",0,{"v":-0.65,"d":"-0.65 "},{"$f":"IF(B10=0,0,C10*VLOOKUP(B10,'§ 13 RVG'!$A$1:$B$250,2))","v":0},{"$f":"IF(B10=0,0,C10*VLOOKUP(B10,'§ 49 RVG'!$A$1:$B$19,2))","v":0}]
["Bei Anrechnung von Beratungshilfe Betrag in die gelbe Zelle einsetzen",null,null,0,0]
["Reisekosten",0,null,{"$f":"B12*0.42","v":0},{"$f":"B12*0.42","v":0},null,null,4.01,50]
["Abwesenheitsgeld",0,null,{"$f":"IF(B13<=0,0,(VLOOKUP(B13,H8:I13,2)))","v":0},{"$f":"IF(B13<=0,0,(VLOOKUP(B13,H8:I13,2)))","v":0},null,null,8.01,70]
["Kopien",0,null,{"$f":"IF(B14<=50,B14*0.5,(50*0.5+(B14-50)*0.15))","v":0},{"$f":"IF(B14<=50,B14*0.5,(50*0.5+(B14-50)*0.15))","v":0},null,{"$f":"SUM(D4:D9)*(20/100)","v":167}]
["Auslagen",null,null,{"$f":"IF(G14<20,G14,20)","v":{"v":20,"d":"20.00 €"}},{"$f":"IF(G14<20,G14,20)","v":{"v":20,"d":"20.00 €"}},null,{"$f":"SUM(E4:E9)*20/100","v":{"v":142,"d":"142.00 €"}}]
[null,"Summe (ohne U-Steuer):",null,{"$f":"SUM(D4:D15)","v":{"v":855,"d":"855.00 €"}},{"$f":"SUM(E4:E15)","v":{"v":730,"d":"730.00 €"}}]
["Umsatzsteuer",19,"%",{"$f":"SUM(D4:D15)*(B17/100)","v":{"v":162.45,"d":"162.45 €"}},{"$f":"SUM(E4:E15)*(B17/100)","v":{"v":138.7,"d":"138.70 €"}}]
[null,null,"Summe:",{"$f":"D16+D17","v":{"v":1017.45,"d":"1,017.45 €"}},{"$f":"E16+E17","v":{"v":868.7,"d":"868.70 €"}}]
[null,null,"weitere Vergütung",{"$f":"D18-E18","v":{"v":148.75,"d":"148.75 €"}}]
["Erhaltene Zahlungen",{"v":0,"d":"0.00 €"},"verbleiben",{"$f":"D18-B20","v":{"v":1017.45,"d":"1,017.45 €"}},{"$f":"E18-B20","v":{"v":868.7,"d":"868.70 €"}}]
[]
["Bei Kostenfestsetzung:","Gerichtskosten: ",0,{"$f":"IF(C22<>0,D18+C22+C23,0)","v":0},"Summe Anwalts- und Gerichtskosten"]
[null,"Kosten weiterer Anwalt (Unter- bevollmächtigter pp.)",0,{"$f":"IF(C22<>0,D16+C22+C23,0)","v":0},"Summe Anwalts- und Gerichtskosten bei Vorsteuerabzug"]
["© J. Bitter"]
[null,null," "]

{"sheet":"§ 13 RVG","index":1,"n_rows":250,"n_cols":4,"rows_kept":250,"hidden":true}
[{"v":0,"d":"0.00 €"},{"v":49,"d":"49.00 €"}]
[{"v":500.01,"d":"500.01 €"},{"v":88,"d":"88.00 €"}]
[{"v":1000.01,"d":"1,000.01 €"},{"v":127,"d":"127.00 €"}]
[{"v":1500.01,"d":"1,500.01 €"},{"v":166,"d":"166.00 €"}]
[{"v":2000.01,"d":"2,000.01 €"},{"v":222,"d":"222.00 €"}]
[{"v":3000.01,"d":"3,000.01 €"},{"v":278,"d":"278.00 €"}]
[{"v":4000.01,"d":"4,000.01 €"},{"v":334,"d":"334.00 €"}]
[{"v":5000.01,"d":"5,000.01 €"},{"v":390,"d":"390.00 €"}]
[{"v":6000.01,"d":"6,000.01 €"},{"v":446,"d":"446.00 €"}]
[{"v":7000.01,"d":"7,000.01 €"},{"v":502,"d":"502.00 €"}]
[{"v":8000.01,"d":"8,000.01 €"},{"v":558,"d":"558.00 €"}]
[{"v":9000.01,"d":"9,000.01 €"},{"v":614,"d":"614.00 €"}]
[{"v":10000.01,"d":"10,000.01 €"},{"v":666,"d":"666.00 €"}]
[{"v":13000.01,"d":"13,000.01 €"},{"v":718,"d":"718.00 €"}]
[{"v":16000.01,"d":"16,000.01 €"},{"v":770,"d":"770.00 €"}]
[{"v":19000.01,"d":"19,000.01 €"},{"v":822,"d":"822.00 €"}]
[{"v":22000.01,"d":"22,000.01 €"},{"v":874,"d":"874.00 €"}]
[{"v":25000.01,"d":"25,000.01 €"},{"v":955,"d":"955.00 €"}]
[{"v":30000.01,"d":"30,000.01 €"},{"v":1036,"d":"1,036.00 €"}]
[{"v":35000.01,"d":"35,000.01 €"},{"v":1117,"d":"1,117.00 €"}]
[{"v":40000.01,"d":"40,000.01 €"},{"v":1198,"d":"1,198.00 €"}]
[{"v":45000.01,"d":"45,000.01 €"},{"v":1279,"d":"1,279.00 €"}]
[{"v":50000.01,"d":"50,000.01 €"},{"v":1373,"d":"1,373.00 €"}]
[{"v":65000.01,"d":"65,000.01 €"},{"v":1467,"d":"1,467.00 €"},null," "]
[{"v":80000.01,"d":"80,000.01 €"},{"v":1561,"d":"1,561.00 €"}]
[{"v":95000.01,"d":"95,000.01 €"},{"v":1655,"d":"1,655.00 €"}]
[{"v":110000.01,"d":"110,000.01 €"},{"v":1749,"d":"1,749.00 €"}]
[{"v":125000.01,"d":"125,000.01 €"},{"v":1843,"d":"1,843.00 €"}]
[{"v":140000.01,"d":"140,000.01 €"},{"v":1937,"d":"1,937.00 €"}]
[{"v":155000.01,"d":"155,000.01 €"},{"v":2031,"d":"2,031.00 €"}]
[{"v":170000.01,"d":"170,000.01 €"},{"v":2125,"d":"2,125.00 €"}]
[{"v":185000.01,"d":"185,000.01 €"},{"v":2219,"d":"2,219.00 €"}]
[{"v":200000.01,"d":"200,000.01 €"},{"v":2351,"d":"2,351.00 €"}]
[{"v":230000.01,"d":"230,000.01 €"},{"v":2483,"d":"2,483.00 €"}]
[{"v":260000.01,"d":"260,000.01 €"},{"v":2615,"d":"2,615.00 €"}]
[{"v":290000.01,"d":"290,000.01 €"},{"v":2747,"d":"2,747.00 €"}]
[{"v":320000.01,"d":"320,000.01 €"},{"v":2879,"d":"2,879.00 €"}]
[{"v":350000.01,"d":"350,000.01 €"},{"v":3011,"d":"3,011.00 €"}]
[{"v":380000.01,"d":"380,000.01 €"},{"v":3143,"d":"3,143.00 €"}]
[{"v":410000.01,"d":"410,000.01 €"},{"v":3275,"d":"3,275.00 €"}]
[{"v":440000.01,"d":"440,000.01 €"},{"v":3407,"d":"3,407.00 €"}]
[{"v":470000.01,"d":"470,000.01 €"},{"v":3539,"d":"3,539.00 €"}]
[{"v":500000.01,"d":"500,000.01 €"},{"v":3704,"d":"3,704.00 €"}]
[{"v":550000.01,"d":"550,000.01 €"},{"v":3869,"d":"3,869.00 €"}]
[{"v":600000.01,"d":"600,000.01 €"},{"v":4034,"d":"4,034.00 €"}]
[{"v":650000.01,"d":"650,000.01 €"},{"v":4199,"d":"4,199.00 €"}]
[{"v":700000.01,"d":"700,000.01 €"},{"v":4364,"d":"4,364.00 €"}]
[{"v":750000.01,"d":"750,000.01 €"},{"v":4529,"d":"4,529.00 €"}]
[{"v":800000.01,"d":"800,000.01 €"},{"v":4694,"d":"4,694.00 €"}]
[{"v":850000.01,"d":"850,000.01 €"},{"v":4859,"d":"4,859.00 €"}]
[{"v":900000.01,"d":"900,000.01 €"},{"v":5024,"d":"5,024.00 €"}]
[{"v":950000.01,"d":"950,000.01 €"},{"v":5189,"d":"5,189.00 €"}]
[{"v":1000000.01,"d":"1,000,000.01 €"},{"v":5354,"d":"5,354.00 €"}]
[{"v":1050000.01,"d":"1,050,000.01 €"},{"v":5519,"d":"5,519.00 €"}]
[{"v":1100000.01,"d":"1,100,000.01 €"},{"v":5684,"d":"5,684.00 €"}]
[{"v":1150000.01,"d":"1,150,000.01 €"},{"v":5849,"d":"5,849.00 €"}]
[{"v":1200000.01,"d":"1,200,000.01 €"},{"v":6014,"d":"6,014.00 €"}]
[{"v":1250000.01,"d":"1,250,000.01 €"},{"v":6179,"d":"6,179.00 €"}]
[{"v":1300000.01,"d":"1,300,000.01 €"},{"v":6344,"d":"6,344.00 €"}]
[{"v":1350000.01,"d":"1,350,000.01 €"},{"v":6509,"d":"6,509.00 €"}]
[{"v":1400000.01,"d":"1,400,000.01 €"},{"v":6674,"d":"6,674.00 €"}]
[{"v":1450000.01,"d":"1,450,000.01 €"},{"v":6839,"d":"6,839.00 €"}]
[{"v":1500000.01,"d":"1,500,000.01 €"},{"v":7004,"d":"7,004.00 €"}]
[{"v":1550000.01,"d":"1,550,000.01 €"},{"v":7169,"d":"7,169.00 €"}]
[{"v":1600000.01,"d":"1,600,000.01 €"},{"v":7334,"d":"7,334.00 €"}]
[{"v":1650000.01,"d":"1,650,000.01 €"},{"v":7499,"d":"7,499.00 €"}]
[{"v":1700000.01,"d":"1,700,000.01 €"},{"v":7664,"d":"7,664.00 €"}]
[{"v":1750000.01,"d":"1,750,000.01 €"},{"v":7829,"d":"7,829.00 €"}]
[{"v":1800000.01,"d":"1,800,000.01 €"},{"v":7994,"d":"7,994.00 €"}]
[{"v":1850000.01,"d":"1,850,000.01 €"},{"v":8159,"d":"8,159.00 €"}]
[{"v":1900000.01,"d":"1,900,000.01 €"},{"v":8324,"d":"8,324.00 €"}]
[{"v":1950000.01,"d":"1,950,000.01 €"},{"v":8489,"d":"8,489.00 €"}]
[{"v":2000000.01,"d":"2,000,000.01 €"},{"$f":"B72+165","v":{"v":8654,"d":"8,654.00 €"}}]
[{"v":2050000.01,"d":"2,050,000.01 €"},{"$f":"B73+165","v":{"v":8819,"d":"8,819.00 €"}}]
[{"v":2100000.01,"d":"2,100,000.01 €"},{"$f":"B74+165","v":{"v":8984,"d":"8,984.00 €"}}]
[{"v":2150000.01,"d":"2,150,000.01 €"},{"v":9149,"d":"9,149.00 €"}]
[{"v":2200000.01,"d":"2,200,000.01 €"},{"v":9314,"d":"9,314.00 €"}]
[{"v":2250000.01,"d":"2,250,000.01 €"},{"v":9479,"d":"9,479.00 €"}]
[{"v":2300000.01,"d":"2,300,000.01 €"},{"v":9644,"d":"9,644.00 €"}]
[{"v":2350000.01,"d":"2,350,000.01 €"},{"v":9809,"d":"9,809.00 €"}]
[{"v":2400000.01,"d":"2,400,000.01 €"},{"v":9974,"d":"9,974.00 €"}]
[{"v":2450000.01,"d":"2,450,000.01 €"},{"v":10139,"d":"10,139.00 €"}]
[{"v":2500000.01,"d":"2,500,000.01 €"},{"v":10304,"d":"10,304.00 €"}]
[{"v":2550000.01,"d":"2,550,000.01 €"},{"v":10469,"d":"10,469.00 €"}]
[{"v":2600000.01,"d":"2,600,000.01 €"},{"v":10634,"d":"10,634.00 €"}]
[{"v":2650000.01,"d":"2,650,000.01 €"},{"v":10799,"d":"10,799.00 €"}]
[{"v":2700000.01,"d":"2,700,000.01 €"},{"v":10964,"d":"10,964.00 €"}]
[{"v":2750000.01,"d":"2,750,000.01 €"},{"v":11129,"d":"11,129.00 €"}]
[{"v":2800000.01,"d":"2,800,000.01 €"},{"v":11294,"d":"11,294.00 €"}]
[{"v":2850000.01,"d":"2,850,000.01 €"},{"v":11459,"d":"11,459.00 €"}]
[{"v":2900000.01,"d":"2,900,000.01 €"},{"v":11624,"d":"11,624.00 €"}]
[{"v":2950000.01,"d":"2,950,000.01 €"},{"v":11789,"d":"11,789.00 €"}]
[{"v":3000000.01,"d":"3,000,000.01 €"},{"v":11954,"d":"11,954.00 €"}]
[{"v":3050000.01,"d":"3,050,000.01 €"},{"v":12119,"d":"12,119.00 €"}]
[{"v":3100000.01,"d":"3,100,000.01 €"},{"v":12284,"d":"12,284.00 €"}]
[{"v":3150000.01,"d":"3,150,000.01 €"},{"v":12449,"d":"12,449.00 €"}]
[{"v":3200000.01,"d":"3,200,000.01 €"},{"v":12614,"d":"12,614.00 €"}]
[{"v":3250000.01,"d":"3,250,000.01 €"},{"v":12779,"d":"12,779.00 €"}]
[{"v":3300000.01,"d":"3,300,000.01 €"},{"v":12944,"d":"12,944.00 €"}]
[{"v":3350000.01,"d":"3,350,000.01 €"},{"v":13109,"d":"13,109.00 €"}]
[{"v":3400000.01,"d":"3,400,000.01 €"},{"v":13274,"d":"13,274.00 €"}]
[{"v":3450000.01,"d":"3,450,000.01 €"},{"v":13439,"d":"13,439.00 €"}]
[{"v":3500000.01,"d":"3,500,000.01 €"},{"v":13604,"d":"13,604.00 €"}]
[{"v":3550000.01,"d":"3,550,000.01 €"},{"v":13769,"d":"13,769.00 €"}]
[{"v":3600000.01,"d":"3,600,000.01 €"},{"v":13934,"d":"13,934.00 €"}]
[{"v":3650000.01,"d":"3,650,000.01 €"},{"v":14099,"d":"14,099.00 €"}]
[{"v":3700000.01,"d":"3,700,000.01 €"},{"v":14264,"d":"14,264.00 €"}]
[{"v":3750000.01,"d":"3,750,000.01 €"},{"v":14429,"d":"14,429.00 €"}]
[{"v":3800000.01,"d":"3,800,000.01 €"},{"v":14594,"d":"14,594.00 €"}]
[{"v":3850000.01,"d":"3,850,000.01 €"},{"v":14759,"d":"14,759.00 €"}]
[{"v":3900000.01,"d":"3,900,000.01 €"},{"v":14924,"d":"14,924.00 €"}]
[{"v":3950000.01,"d":"3,950,000.01 €"},{"v":15089,"d":"15,089.00 €"}]
[{"v":4000000.01,"d":"4,000,000.01 €"},{"v":15254,"d":"15,254.00 €"}]
[{"v":4050000.01,"d":"4,050,000.01 €"},{"v":15419,"d":"15,419.00 €"}]
[{"v":4100000.01,"d":"4,100,000.01 €"},{"v":15584,"d":"15,584.00 €"}]
[{"v":4150000.01,"d":"4,150,000.01 €"},{"v":15749,"d":"15,749.00 €"}]
[{"v":4200000.01,"d":"4,200,000.01 €"},{"v":15914,"d":"15,914.00 €"}]
[{"v":4250000.01,"d":"4,250,000.01 €"},{"v":16079,"d":"16,079.00 €"}]
[{"v":4300000.01,"d":"4,300,000.01 €"},{"v":16244,"d":"16,244.00 €"}]
[{"v":4350000.01,"d":"4,350,000.01 €"},{"v":16409,"d":"16,409.00 €"}]
[{"v":4400000.01,"d":"4,400,000.01 €"},{"v":16574,"d":"16,574.00 €"}]
[{"v":4450000.01,"d":"4,450,000.01 €"},{"v":16739,"d":"16,739.00 €"}]
[{"v":4500000.01,"d":"4,500,000.01 €"},{"v":16904,"d":"16,904.00 €"}]
[{"v":4550000.01,"d":"4,550,000.01 €"},{"v":17069,"d":"17,069.00 €"}]
[{"v":4600000.01,"d":"4,600,000.01 €"},{"v":17234,"d":"17,234.00 €"}]
[{"v":4650000.01,"d":"4,650,000.01 €"},{"v":17399,"d":"17,399.00 €"}]
[{"v":4700000.01,"d":"4,700,000.01 €"},{"v":17564,"d":"17,564.00 €"}]
[{"v":4750000.01,"d":"4,750,000.01 €"},{"v":17729,"d":"17,729.00 €"}]
[{"v":4800000.01,"d":"4,800,000.01 €"},{"v":17894,"d":"17,894.00 €"}]
[{"v":4850000.01,"d":"4,850,000.01 €"},{"v":18059,"d":"18,059.00 €"}]
[{"v":4900000.01,"d":"4,900,000.01 €"},{"v":18224,"d":"18,224.00 €"}]
[{"v":4950000.01,"d":"4,950,000.01 €"},{"v":18389,"d":"18,389.00 €"}]
[{"v":5000000.01,"d":"5,000,000.01 €"},{"v":18554,"d":"18,554.00 €"}]
[{"v":5050000.01,"d":"5,050,000.01 €"},{"v":18719,"d":"18,719.00 €"}]
[{"v":5100000.01,"d":"5,100,000.01 €"},{"v":18884,"d":"18,884.00 €"}]
[{"v":5150000.01,"d":"5,150,000.01 €"},{"v":19049,"d":"19,049.00 €"}]
[{"v":5200000.01,"d":"5,200,000.01 €"},{"v":19214,"d":"19,214.00 €"}]
[{"v":5250000.01,"d":"5,250,000.01 €"},{"v":19379,"d":"19,379.00 €"}]
[{"v":5300000.01,"d":"5,300,000.01 €"},{"$f":"B138+165","v":{"v":19544,"d":"19,544.00 €"}}]
[{"v":5350000.01,"d":"5,350,000.01 €"},{"v":19709,"d":"19,709.00 €"}]
[{"v":5400000.01,"d":"5,400,000.01 €"},{"v":19874,"d":"19,874.00 €"}]
[{"v":5450000.01,"d":"5,450,000.01 €"},{"v":20039,"d":"20,039.00 €"}]
[{"v":5500000.01,"d":"5,500,000.01 €"},{"v":20204,"d":"20,204.00 €"}]
[{"v":5550000.01,"d":"5,550,000.01 €"},{"v":20369,"d":"20,369.00 €"}]
[{"v":5600000.01,"d":"5,600,000.01 €"},{"v":20534,"d":"20,534.00 €"}]
[{"v":5650000.01,"d":"5,650,000.01 €"},{"v":20699,"d":"20,699.00 €"}]
[{"v":5700000.01,"d":"5,700,000.01 €"},{"v":20864,"d":"20,864.00 €"}]
[{"v":5750000.01,"d":"5,750,000.01 €"},{"v":21029,"d":"21,029.00 €"}]
[{"v":5800000.01,"d":"5,800,000.01 €"},{"v":21194,"d":"21,194.00 €"}]
[{"v":5850000.01,"d":"5,850,000.01 €"},{"v":21359,"d":"21,359.00 €"}]
[{"v":5900000.01,"d":"5,900,000.01 €"},{"v":21524,"d":"21,524.00 €"}]
[{"v":5950000.01,"d":"5,950,000.01 €"},{"v":21689,"d":"21,689.00 €"}]
[{"v":6000000.01,"d":"6,000,000.01 €"},{"v":21854,"d":"21,854.00 €"}]
[{"v":6050000.01,"d":"6,050,000.01 €"},{"v":22019,"d":"22,019.00 €"}]
[{"v":6100000.01,"d":"6,100,000.01 €"},{"v":22184,"d":"22,184.00 €"}]
[{"v":6150000.01,"d":"6,150,000.01 €"},{"v":22349,"d":"22,349.00 €"}]
[{"v":6200000.01,"d":"6,200,000.01 €"},{"v":22514,"d":"22,514.00 €"}]
[{"v":6250000.01,"d":"6,250,000.01 €"},{"v":22679,"d":"22,679.00 €"}]
[{"v":6300000.01,"d":"6,300,000.01 €"},{"v":22844,"d":"22,844.00 €"}]
[{"v":6350000.01,"d":"6,350,000.01 €"},{"v":23009,"d":"23,009.00 €"}]
[{"v":6400000.01,"d":"6,400,000.01 €"},{"v":23174,"d":"23,174.00 €"}]
[{"v":6450000.01,"d":"6,450,000.01 €"},{"v":23339,"d":"23,339.00 €"}]
[{"v":6500000.01,"d":"6,500,000.01 €"},{"v":23504,"d":"23,504.00 €"}]
[{"v":6550000.01,"d":"6,550,000.01 €"},{"v":23669,"d":"23,669.00 €"}]
[{"v":6600000.01,"d":"6,600,000.01 €"},{"v":23834,"d":"23,834.00 €"}]
[{"v":6650000.01,"d":"6,650,000.01 €"},{"v":23999,"d":"23,999.00 €"}]
[{"v":6700000.01,"d":"6,700,000.01 €"},{"v":24164,"d":"24,164.00 €"}]
[{"v":6750000.01,"d":"6,750,000.01 €"},{"v":24329,"d":"24,329.00 €"}]
[{"v":6800000.01,"d":"6,800,000.01 €"},{"v":24494,"d":"24,494.00 €"}]
[{"v":6850000.01,"d":"6,850,000.01 €"},{"v":24659,"d":"24,659.00 €"}]
[{"v":6900000.01,"d":"6,900,000.01 €"},{"v":24824,"d":"24,824.00 €"}]
[{"v":6950000.01,"d":"6,950,000.01 €"},{"v":24989,"d":"24,989.00 €"}]
[{"v":7000000.01,"d":"7,000,000.01 €"},{"v":25154,"d":"25,154.00 €"}]
[{"v":7050000.01,"d":"7,050,000.01 €"},{"v":25319,"d":"25,319.00 €"}]
[{"v":7100000.01,"d":"7,100,000.01 €"},{"v":25484,"d":"25,484.00 €"}]
[{"v":7150000.01,"d":"7,150,000.01 €"},{"v":25649,"d":"25,649.00 €"}]
[{"v":7200000.01,"d":"7,200,000.01 €"},{"v":25814,"d":"25,814.00 €"}]
[{"v":7250000.01,"d":"7,250,000.01 €"},{"v":25979,"d":"25,979.00 €"}]
[{"v":7300000.01,"d":"7,300,000.01 €"},{"v":26144,"d":"26,144.00 €"}]
[{"v":7350000.01,"d":"7,350,000.01 €"},{"v":26309,"d":"26,309.00 €"}]
[{"v":7400000.01,"d":"7,400,000.01 €"},{"v":26474,"d":"26,474.00 €"}]
[{"v":7450000.01,"d":"7,450,000.01 €"},{"v":26639,"d":"26,639.00 €"}]
[{"v":7500000.01,"d":"7,500,000.01 €"},{"v":26804,"d":"26,804.00 €"}]
[{"v":7550000.01,"d":"7,550,000.01 €"},{"v":26969,"d":"26,969.00 €"}]
[{"v":7600000.01,"d":"7,600,000.01 €"},{"v":27134,"d":"27,134.00 €"}]
[{"v":7650000.01,"d":"7,650,000.01 €"},{"v":27299,"d":"27,299.00 €"}]
[{"v":7700000.01,"d":"7,700,000.01 €"},{"v":27464,"d":"27,464.00 €"}]
[{"v":7750000.01,"d":"7,750,000.01 €"},{"v":27629,"d":"27,629.00 €"}]
[{"v":7800000.01,"d":"7,800,000.01 €"},{"v":27794,"d":"27,794.00 €"}]
[{"v":7850000.01,"d":"7,850,000.01 €"},{"v":27959,"d":"27,959.00 €"}]
[{"v":7900000.01,"d":"7,900,000.01 €"},{"v":28124,"d":"28,124.00 €"}]
[{"v":7950000.01,"d":"7,950,000.01 €"},{"v":28289,"d":"28,289.00 €"}]
[{"v":8000000.01,"d":"8,000,000.01 €"},{"v":28454,"d":"28,454.00 €"}]
[{"v":8050000.01,"d":"8,050,000.01 €"},{"v":28619,"d":"28,619.00 €"}]
[{"v":8100000.01,"d":"8,100,000.01 €"},{"v":28784,"d":"28,784.00 €"}]
[{"v":8150000.01,"d":"8,150,000.01 €"},{"v":28949,"d":"28,949.00 €"}]
[{"v":8200000.01,"d":"8,200,000.01 €"},{"v":29114,"d":"29,114.00 €"}]
[{"v":8250000.01,"d":"8,250,000.01 €"},{"v":29279,"d":"29,279.00 €"}]
[{"v":8300000.01,"d":"8,300,000.01 €"},{"v":29444,"d":"29,444.00 €"}]
[{"v":8350000.01,"d":"8,350,000.01 €"},{"v":29609,"d":"29,609.00 €"}]
[{"v":8400000.01,"d":"8,400,000.01 €"},{"v":29774,"d":"29,774.00 €"}]
[{"v":8450000.01,"d":"8,450,000.01 €"},{"v":29939,"d":"29,939.00 €"}]
[{"v":8500000.01,"d":"8,500,000.01 €"},{"$f":"B202+165","v":{"v":30104,"d":"30,104.00 €"}}]
[{"v":8550000.01,"d":"8,550,000.01 €"},{"v":30269,"d":"30,269.00 €"}]
[{"v":8600000.01,"d":"8,600,000.01 €"},{"v":30434,"d":"30,434.00 €"}]
[{"v":8650000.01,"d":"8,650,000.01 €"},{"v":30599,"d":"30,599.00 €"}]
[{"v":8700000.01,"d":"8,700,000.01 €"},{"v":30764,"d":"30,764.00 €"}]
[{"v":8750000.01,"d":"8,750,000.01 €"},{"v":30929,"d":"30,929.00 €"}]
[{"v":8800000.01,"d":"8,800,000.01 €"},{"v":31094,"d":"31,094.00 €"}]
[{"v":8850000.01,"d":"8,850,000.01 €"},{"v":31259,"d":"31,259.00 €"}]
[{"v":8900000.01,"d":"8,900,000.01 €"},{"v":31424,"d":"31,424.00 €"}]
[{"v":8950000.01,"d":"8,950,000.01 €"},{"v":31589,"d":"31,589.00 €"}]
[{"v":9000000.01,"d":"9,000,000.01 €"},{"v":31754,"d":"31,754.00 €"}]
[{"v":9050000.01,"d":"9,050,000.01 €"},{"v":31919,"d":"31,919.00 €"}]
[{"v":9100000.01,"d":"9,100,000.01 €"},{"v":32084,"d":"32,084.00 €"}]
[{"v":9150000.01,"d":"9,150,000.01 €"},{"v":32249,"d":"32,249.00 €"}]
[{"v":9200000.01,"d":"9,200,000.01 €"},{"v":32414,"d":"32,414.00 €"}]
[{"v":9250000.01,"d":"9,250,000.01 €"},{"v":32579,"d":"32,579.00 €"}]
[{"v":9300000.01,"d":"9,300,000.01 €"},{"v":32744,"d":"32,744.00 €"}]
[{"v":9350000.01,"d":"9,350,000.01 €"},{"v":32909,"d":"32,909.00 €"}]
[{"v":9400000.01,"d":"9,400,000.01 €"},{"v":33074,"d":"33,074.00 €"}]
[{"v":9450000.01,"d":"9,450,000.01 €"},{"v":33239,"d":"33,239.00 €"}]
[{"v":9500000.01,"d":"9,500,000.01 €"},{"v":33404,"d":"33,404.00 €"}]
[{"v":9550000.01,"d":"9,550,000.01 €"},{"v":33569,"d":"33,569.00 €"}]
[{"v":9600000.01,"d":"9,600,000.01 €"},{"v":33734,"d":"33,734.00 €"}]
[{"v":9650000.01,"d":"9,650,000.01 €"},{"v":33899,"d":"33,899.00 €"}]
[{"v":9700000.01,"d":"9,700,000.01 €"},{"v":34064,"d":"34,064.00 €"}]
[{"v":9750000.01,"d":"9,750,000.01 €"},{"v":34229,"d":"34,229.00 €"}]
[{"v":9800000.01,"d":"9,800,000.01 €"},{"v":34394,"d":"34,394.00 €"}]
[{"v":9850000.01,"d":"9,850,000.01 €"},{"v":34559,"d":"34,559.00 €"}]
[{"v":9900000.01,"d":"9,900,000.01 €"},{"v":34724,"d":"34,724.00 €"}]
[{"v":9950000.01,"d":"9,950,000.01 €"},{"v":34889,"d":"34,889.00 €"}]
[{"v":10000000.01,"d":"10,000,000.01 €"},{"v":35054,"d":"35,054.00 €"}]
[{"v":10050000.01,"d":"10,050,000.01 €"},{"v":35219,"d":"35,219.00 €"}]
[{"v":10100000.01,"d":"10,100,000.01 €"},{"v":35384,"d":"35,384.00 €"}]
[{"v":10150000.01,"d":"10,150,000.01 €"},{"v":35549,"d":"35,549.00 €"}]
[{"v":10200000.01,"d":"10,200,000.01 €"},{"v":35714,"d":"35,714.00 €"}]
[{"v":10250000.01,"d":"10,250,000.01 €"},{"v":35879,"d":"35,879.00 €"}]
[{"v":10300000.01,"d":"10,300,000.01 €"},{"v":36044,"d":"36,044.00 €"}]
[{"v":10350000.01,"d":"10,350,000.01 €"},{"v":36209,"d":"36,209.00 €"}]
[{"v":10400000.01,"d":"10,400,000.01 €"},{"v":36374,"d":"36,374.00 €"}]
[{"v":10450000.01,"d":"10,450,000.01 €"},{"v":36539,"d":"36,539.00 €"}]
[{"v":10500000.01,"d":"10,500,000.01 €"},{"v":36704,"d":"36,704.00 €"}]
[{"v":10550000.01,"d":"10,550,000.01 €"},{"v":36869,"d":"36,869.00 €"}]
[{"v":10600000.01,"d":"10,600,000.01 €"},{"v":37034,"d":"37,034.00 €"}]
[{"v":10650000.01,"d":"10,650,000.01 €"},{"v":37199,"d":"37,199.00 €"}]
[{"v":10700000.01,"d":"10,700,000.01 €"},{"v":37364,"d":"37,364.00 €"}]
[{"v":10750000.01,"d":"10,750,000.01 €"},{"v":37529,"d":"37,529.00 €"}]
[{"v":10800000.01,"d":"10,800,000.01 €"},{"v":37694,"d":"37,694.00 €"}]
[{"v":10850000.01,"d":"10,850,000.01 €"},{"v":37859,"d":"37,859.00 €"}]

{"sheet":"§ 49 RVG","index":2,"n_rows":23,"n_cols":2,"rows_kept":23,"hidden":true}
[{"v":0,"d":"0.00 €"},{"v":49,"d":"49.00 €"}]
[{"v":500.01,"d":"500.01 €"},{"v":88,"d":"88.00 €"}]
[{"v":1000.01,"d":"1,000.01 €"},{"v":127,"d":"127.00 €"}]
[{"v":1500.01,"d":"1,500.01 €"},{"v":166,"d":"166.00 €"}]
[{"v":2000.01,"d":"2,000.01 €"},{"v":222,"d":"222.00 €"}]
[{"v":3000.01,"d":"3,000.01 €"},{"v":278,"d":"278.00 €"}]
[{"v":4000.01,"d":"4,000.01 €"},{"v":284,"d":"284.00 €"}]
[{"v":5000.01,"d":"5,000.01 €"},{"v":295,"d":"295.00 €"}]
[{"v":6000.01,"d":"6,000.01 €"},{"v":306,"d":"306.00 €"}]
[{"v":7000.01,"d":"7,000.01 €"},{"v":317,"d":"317.00 €"}]
[{"v":8000.01,"d":"8,000.01 €"},{"v":328,"d":"328.00 €"}]
[{"v":9000.01,"d":"9,000.01 €"},{"v":339,"d":"339.00 €"}]
[{"v":10000.01,"d":"10,000.01 €"},{"v":354,"d":"354.00 €"}]
[{"v":13000.01,"d":"13,000.01 €"},{"v":369,"d":"369.00 €"}]
[{"v":16000.01,"d":"16,000.01 €"},{"v":384,"d":"384.00 €"}]
[{"v":19000.01,"d":"19,000.01 €"},{"v":399,"d":"399.00 €"}]
[{"v":22000.01,"d":"22,000.01 €"},{"v":414,"d":"414.00 €"}]
[{"v":25000.01,"d":"25,000.01 €"},{"v":453,"d":"453.00 €"}]
[{"v":30000.01,"d":"30,000.01 €"},{"v":492,"d":"492.00 €"}]
[{"v":35000.01,"d":"35,000.01 €"},{"v":531,"d":"531.00 €"}]
[{"v":40000.01,"d":"40,000.01 €"},{"v":570,"d":"570.00 €"}]
[{"v":45000.01,"d":"45,000.01 €"},{"v":609,"d":"609.00 €"}]
[{"v":50000.01,"d":"50,000.01 €"},{"v":659,"d":"659.00 €"}]

{"sheet":"Tabelle2","index":3,"n_rows":0,"n_cols":0,"rows_kept":0}